BDBM286300 5-amino-3-(7-ethoxyquinolin-3- yl)-1-(3-hydroxy-3-methylbutan- 2-yl)-1H-pyrazole-4-carboxamide 1H NMR (500 MHz, MeOD) $#948; 9.31 (s, 1H), 9.26 (s, 1H), 8.30 (d, J = 9.2 Hz, 1H), 7.62 (d, J = 9.2 Hz, 1H), 7.54 (s, 1H), 4.38 (q, J = 7.0 Hz, 2H), 4.36-4.29 (m, 1H), 1.59-1.53 (m, 6H), 1.30 (s, 3H), 1.26 (s, 3H), MS (ESI) (M + H)+ = 384.6::US9518026, Example 93::US9956214, Compound 1626
SMILES CCOc1ccc2cc(cnc2c1)-c1nn(C(C)C(C)(C)O)c(N)c1C(N)=O
InChI Key InChIKey=UZRSJQXLFKNVMY-UHFFFAOYSA-N
Data  4 IC50
  Tab Delimited (TSV)   2D SDfile   Computed 3D by Vconf -m prep SDfile
Find this compound or compounds like it in BindingDB:
Activity Spreadsheet -- Enzyme Inhibition Constant Data from BindingDB
Found 2 hits for monomerid = 286300
TargetCalmodulin-domain protein kinase 1(Toxoplasma gondii)
University of Washington Through Its Center For Commercialization
US Patent
LigandPNGBDBM286300(5-amino-3-(7-ethoxyquinolin-3- yl)-1-(3-hydroxy-3-...)
Affinity DataIC50:  10nM. Assay description: Inhibition of TgCDPK1 and CpCDPK1 was determined using a luminescent kinase assay which measures ATP depletion in the presence of the Syntide 2 pepti...
Ligand InfoPC cidPC sid
In DepthDetails US Patent
TargetCalmodulin-domain protein kinase 1(Toxoplasma gondii)
University of Washington Through Its Center For Commercialization
US Patent
LigandPNGBDBM286300(5-amino-3-(7-ethoxyquinolin-3- yl)-1-(3-hydroxy-3-...)
Affinity DataIC50:  30nM. Assay description: Inhibition of TgCDPK1 and CpCDPK1 was determined using a luminescent kinase assay which measures ATP depletion in the presence of the Syntide 2 pepti...
Ligand InfoPC cidPC sid
In DepthDetails US Patent